Target
Interleukin-1 receptor-associated kinase 4
Ligand
BDBM504433
Substrate
Meas. Tech.
Biochemical Assay
IC50
650±n/a nM
Citation
 Crew, APAraujo, E Compounds and methods for the targeted degradation of interleukin-1 receptor- associated kinase 4 polypeptides US Patent  US11065231 Publication Date 7/20/2021 
Target
Name:
Interleukin-1 receptor-associated kinase 4
Synonyms:
IRAK-4 IRAK4_HUMAN Interleukin-1 receptor-associated kinase 4 (IRAK4) | Renal carcinoma antigen NY-REN-64
Type:
Protein
Mol. Mass.:
51519.08
Organism:
Homo sapiens (Human)
Description:
Q9NWZ3
Residue:
460
  
Inhibitor
Name:
BDBM504433
Synonyms:
N-(3-(4-(2-(2-(2-(2-((2-(2,6- dioxopiperidin-3-yl)-1,3- dioxoisoindolin-5- yl)oxy)ethoxy)ethoxy)ethoxy) ethyl)piperazin-1-yl)-1-(5- methylpyridin-2-yl)-1H- pyrazol-5-yl)pyrazolo[1,5- a]pyrimidine-3-caboxamide | US11065231, Example 26
Type:
Small organic molecule
Emp. Form.:
C41H45N11O9
Mol. Mass.:
835.8643
SMILES:
Cc1ccc(nc1)-n1nc(cc1NC(=O)c1cnn2cccnc12)N1CCN(CCOCCOCCOCCOc2ccc3C(=O)N(C4CCC(=O)NC4=O)C(=O)c3c2)CC1
: