Target
Interleukin-1 receptor-associated kinase 4
Ligand
BDBM504435
Substrate
Meas. Tech.
Biochemical Assay
IC50
650±n/a nM
Citation
 Crew, APAraujo, E Compounds and methods for the targeted degradation of interleukin-1 receptor- associated kinase 4 polypeptides US Patent  US11065231 Publication Date 7/20/2021 
Target
Name:
Interleukin-1 receptor-associated kinase 4
Synonyms:
IRAK-4 IRAK4_HUMAN Interleukin-1 receptor-associated kinase 4 (IRAK4) | Renal carcinoma antigen NY-REN-64
Type:
Protein
Mol. Mass.:
51519.08
Organism:
Homo sapiens (Human)
Description:
Q9NWZ3
Residue:
460
  
Inhibitor
Name:
BDBM504435
Synonyms:
N-(3-(4-((S)-16-((2S,4R)-4- hydroxy-2-((4-(4- methylthiazol-5- yl)benzyl)carbamoyl) pyrrolidine-1-carbonyl)-17,17- dimethyl-14-oxo-3,6,9,12- tetraoxa-15- azapentadecyl)piperazin-1- yl)-1-(5-methylpyridin-2-yl)- 1H-pyrazol-5- yl)pyrazolo[1,5- a]pyrimidine-3-carboxamide | US11065231, Example 28
Type:
Small organic molecule
Emp. Form.:
C52H67N13O9S
Mol. Mass.:
1050.235
SMILES:
Cc1ncsc1-c1ccc(CNC(=O)[C@@H]2C[C@@H](O)CN2C(=O)[C@@H](NC(=O)COCCOCCOCCOCCN2CCN(CC2)c2cc(NC(=O)c3cnn4cccnc34)n(n2)-c2ccc(C)cn2)C(C)(C)C)cc1
: