Target
Interleukin-1 receptor-associated kinase 4
Ligand
BDBM504459
Substrate
Meas. Tech.
Biochemical Assay
IC50
>1000±n/a nM
Citation
 Crew, APAraujo, E Compounds and methods for the targeted degradation of interleukin-1 receptor- associated kinase 4 polypeptides US Patent  US11065231 Publication Date 7/20/2021 
Target
Name:
Interleukin-1 receptor-associated kinase 4
Synonyms:
IRAK-4 IRAK4_HUMAN Interleukin-1 receptor-associated kinase 4 (IRAK4) | Renal carcinoma antigen NY-REN-64
Type:
Protein
Mol. Mass.:
51519.08
Organism:
Homo sapiens (Human)
Description:
Q9NWZ3
Residue:
460
  
Inhibitor
Name:
BDBM504459
Synonyms:
4-((1s,4s)-4-(4-((2-(2-(2-(2- ((2-(2,6-dioxopiperidin-3- yl)-1,3-dioxoisoindolin-5- yl)oxy)ethoxy)ethoxy)ethoxy) ethyl)sulfonyl)piperazin-1- yl)cyclohexyl)amino) quinazoline-6-carbonitrile | US11065231, Example 39
Type:
Small organic molecule
Emp. Form.:
C40H48N8O10S
Mol. Mass.:
832.922
SMILES:
O=C1N(C2CCC(=O)NC2=O)C(=O)c2cc(OCCOCCOCCOCCS(=O)(=O)N3CCN(CC3)[C@@H]3CC[C@@H](CC3)Nc3ncnc4ccc(cc34)C#N)ccc12
: