Target
Interleukin-1 receptor-associated kinase 4
Ligand
BDBM504465
Substrate
Meas. Tech.
Biochemical Assay
IC50
>1000±n/a nM
Citation
 Crew, APAraujo, E Compounds and methods for the targeted degradation of interleukin-1 receptor- associated kinase 4 polypeptides US Patent  US11065231 Publication Date 7/20/2021 
Target
Name:
Interleukin-1 receptor-associated kinase 4
Synonyms:
IRAK-4 IRAK4_HUMAN Interleukin-1 receptor-associated kinase 4 (IRAK4) | Renal carcinoma antigen NY-REN-64
Type:
Protein
Mol. Mass.:
51519.08
Organism:
Homo sapiens (Human)
Description:
Q9NWZ3
Residue:
460
  
Inhibitor
Name:
BDBM504465
Synonyms:
N-(1-((1s,4s)-4-((2-((2-(2,6- dioxopiperidin-3-yl)-1,3- dioxoisoindolin-5- yl)oxy)ethoxy)methyl) cyclohexyl)-5-(piperidin-1- ylmethyl)-1H- benzo[d]imidazol-2-yl)-3- (trifluoromethyl)benzamide | US11065231, Example 45
Type:
Small organic molecule
Emp. Form.:
C37H33F4N5O7
Mol. Mass.:
735.6808
SMILES:
Fc1ccc2n([C@@H]3CC[C@H](COCCOc4ccc5C(=O)N(C6CCC(=O)NC6=O)C(=O)c5c4)CC3)c(NC(=O)c3cccc(c3)C(F)(F)F)nc2c1
: