Target
Diacylglycerol O-acyltransferase 2
Ligand
BDBM504497
Substrate
Meas. Tech.
In Vitro Assay
IC50
39.0±n/a nM
Citation
 Edmonds, DJFilipski, KJFutatsugi, KGarnsey, MRLee, JCSmaltz, DJ Diacylglycerol acyl transferase 2 inhibitor US Patent  US11065249 Publication Date 7/20/2021 
Target
Name:
Diacylglycerol O-acyltransferase 2
Synonyms:
ARAT DGAT2 Diacylglycerol O-acyltransferase 2 (DGAT2) Retinol O-fatty-acyltransferase
Type:
Multi-pass membrane protein
Mol. Mass.:
43848.90
Organism:
Homo sapiens (Human)
Description:
Q96PD7
Residue:
388
  
Inhibitor
Name:
BDBM504497
Synonyms:
First-eluting enantiomer from separation of Example 9 (see footnote 5 in Table 1); 2-{5-[(3-ethoxypyridin-2-yl)oxy]pyridin- 3-yl}-N-[6-(trifluoromethyl)piperidin-3- yl]pyrimidine-5-carboxamide, trifluoroacetate salt, ENT-1 US11065249, Example 11 | US11471458, Example 11
Type:
Small organic molecule
Emp. Form.:
C23H23F3N6O3
Mol. Mass.:
488.4623
SMILES:
CCOc1cccnc1Oc1cncc(c1)-c1ncc(cn1)C(=O)NC1CCC(NC1)C(F)(F)F
: