Target
Diacylglycerol O-acyltransferase 2
Ligand
BDBM504511
Substrate
Meas. Tech.
In Vitro Assay
IC50
16000±n/a nM
Citation
 Edmonds, DJFilipski, KJFutatsugi, KGarnsey, MRLee, JCSmaltz, DJ Diacylglycerol acyl transferase 2 inhibitor US Patent  US11065249 Publication Date 7/20/2021 
Target
Name:
Diacylglycerol O-acyltransferase 2
Synonyms:
ARAT DGAT2 Diacylglycerol O-acyltransferase 2 (DGAT2) Retinol O-fatty-acyltransferase
Type:
Multi-pass membrane protein
Mol. Mass.:
43848.90
Organism:
Homo sapiens (Human)
Description:
Q96PD7
Residue:
388
  
Inhibitor
Name:
BDBM504511
Synonyms:
US11065249, Example 24 US20230405002, Example 24 | rac-2-{5-[(3-ethoxypyridin-2- yl)oxy]pyridin-3-yl}-N-[(3R,4S)-4- methylpiperidin-3-yl]pyrimidine-5- carboxamide, trifluoroacetate salt
Type:
Small organic molecule
Emp. Form.:
C23H26N6O3
Mol. Mass.:
434.4909
SMILES:
CCOc1cccnc1Oc1cncc(c1)-c1ncc(cn1)C(=O)N[C@@H]1CNCC[C@H]1C
: