Target
Diacylglycerol O-acyltransferase 2
Ligand
BDBM276751
Substrate
Meas. Tech.
In Vitro Assay
IC50
200±n/a nM
Citation
 Edmonds, DJFilipski, KJFutatsugi, KGarnsey, MRLee, JCSmaltz, DJ Diacylglycerol acyl transferase 2 inhibitor US Patent  US11065249 Publication Date 7/20/2021 
Target
Name:
Diacylglycerol O-acyltransferase 2
Synonyms:
ARAT DGAT2 Diacylglycerol O-acyltransferase 2 (DGAT2) Retinol O-fatty-acyltransferase
Type:
Multi-pass membrane protein
Mol. Mass.:
43848.90
Organism:
Homo sapiens (Human)
Description:
Q96PD7
Residue:
388
  
Inhibitor
Name:
BDBM276751
Synonyms:
(R)-2-(5-((3-Ethoxypyridin-2-yl)oxy)pyridin-3-yl)-N-(tetrahydrofuran-3-yl)pyrimidine-5-carboxamide US10071992, Example 3.7 US11065249, WO2018033832-Ex.-2 | WO2018033832, Ex. 2
Type:
Small organic molecule
Emp. Form.:
C21H21N5O4
Mol. Mass.:
407.4225
SMILES:
CCOc1cccnc1Oc1cncc(c1)-c1ncc(cn1)C(=O)N[C@@H]1CCOC1
: