Target
Diacylglycerol O-acyltransferase 2
Ligand
BDBM276763
Substrate
Meas. Tech.
In Vitro Assay
IC50
3.30±n/a nM
Citation
 Edmonds, DJFilipski, KJFutatsugi, KGarnsey, MRLee, JCSmaltz, DJ Diacylglycerol acyl transferase 2 inhibitor US Patent  US11065249 Publication Date 7/20/2021 
Target
Name:
Diacylglycerol O-acyltransferase 2
Synonyms:
ARAT DGAT2 Diacylglycerol O-acyltransferase 2 (DGAT2) Retinol O-fatty-acyltransferase
Type:
Multi-pass membrane protein
Mol. Mass.:
43848.90
Organism:
Homo sapiens (Human)
Description:
Q96PD7
Residue:
388
  
Inhibitor
Name:
BDBM276763
Synonyms:
US10071992, Example 8 US11065249, WO2018033832-Ex.-8 | WO2018033832, Ex. 8
Type:
Small organic molecule
Emp. Form.:
C21H20FN5O4
Mol. Mass.:
425.413
SMILES:
CCOc1cc(F)cnc1Oc1cncc(c1)-c1ncc(cn1)C(=O)N[C@H]1CCOC1
: