Target
DNA-dependent protein kinase catalytic subunit
Ligand
BDBM315588
Substrate
Meas. Tech.
Biochemical Assay
IC50
<3±n/a nM
Citation
 Fuchss, TEmde, UBuchstaller, HMederski, W Arylquinazolines US Patent  US11065253 Publication Date 7/20/2021 
Target
Name:
DNA-dependent protein kinase catalytic subunit
Synonyms:
DNA-PK catalytic subunit DNA-dependent protein kinase (DNA-PK) DNA-dependent protein kinase catalytic subunit (DNA-PK) HYRC PRKDC | PRKDC_HUMAN
Type:
Protein
Mol. Mass.:
469114.78
Organism:
Homo sapiens (Human)
Description:
P78527
Residue:
4128
  
Inhibitor
Name:
BDBM315588
Synonyms:
US10172859, Example 15 US10172859, Example 38 US9732094, Example 38 | [4-Fluoro-3-(7- morpholin-4-yl- quinazolin-4-yl)phenyl]- (3-methoxy-pyrazin-2- yl)methanol (Ena 2)see racemate
Type:
Small organic molecule
Emp. Form.:
C24H22FN5O3
Mol. Mass.:
447.4616
SMILES:
COc1nccnc1C(O)c1ccc(F)c(c1)-c1ncnc2cc(ccc12)N1CCOCC1
: