Target
DNA-dependent protein kinase catalytic subunit
Ligand
BDBM315594
Substrate
Meas. Tech.
Biochemical Assay
IC50
<3±n/a nM
Citation
 Fuchss, TEmde, UBuchstaller, HMederski, W Arylquinazolines US Patent  US11065253 Publication Date 7/20/2021 
Target
Name:
DNA-dependent protein kinase catalytic subunit
Synonyms:
DNA-PK catalytic subunit DNA-dependent protein kinase (DNA-PK) DNA-dependent protein kinase catalytic subunit (DNA-PK) HYRC PRKDC | PRKDC_HUMAN
Type:
Protein
Mol. Mass.:
469114.78
Organism:
Homo sapiens (Human)
Description:
P78527
Residue:
4128
  
Inhibitor
Name:
BDBM315594
Synonyms:
US10172859, Example 20 US10172859, Example 51 US9732094, Example 51 | [2,4-Difluoro-5-(7- morpholin-4-yl- quinazolin-4-yl)phenyl]- itnidazo[1,2-b]pyridazin- 6-ylmethanol (Ena 2)see racemate
Type:
Small organic molecule
Emp. Form.:
C25H20F2N6O2
Mol. Mass.:
474.4621
SMILES:
OC(c1ccc2nccn2n1)c1cc(c(F)cc1F)-c1ncnc2cc(ccc12)N1CCOCC1
: