Target
DNA-dependent protein kinase catalytic subunit
Ligand
BDBM315666
Substrate
Meas. Tech.
Biochemical Assay
IC50
<3±n/a nM
Citation
 Fuchss, TEmde, UBuchstaller, HMederski, W Arylquinazolines US Patent  US11065253 Publication Date 7/20/2021 
Target
Name:
DNA-dependent protein kinase catalytic subunit
Synonyms:
DNA-PK catalytic subunit DNA-dependent protein kinase (DNA-PK) DNA-dependent protein kinase catalytic subunit (DNA-PK) HYRC PRKDC | PRKDC_HUMAN
Type:
Protein
Mol. Mass.:
469114.78
Organism:
Homo sapiens (Human)
Description:
P78527
Residue:
4128
  
Inhibitor
Name:
BDBM315666
Synonyms:
6-{[4-Fluoro-3-(7- morpholin-4-yl- quinazolin-4-yl)- phenyl]hydroxy- methyl}-1-methyl-1H- pyridin-2-one1H NMR (500 MHz, DMSO-d6) ppm = 9.10 (s, 1H), 7.60-7.56 (m, 2H), 7.55-7.51 (m, 2H), 7.48- 7.43 (m, 1H), 7.40 (dd, J = 9.1, 6.9, 1H), 7.21-7.19 (m, 1H), 6.52 (d, J = 5.3, 1H), 6.36 (dd, J = 9.1, 1.4, 1H), 6.25 (dd, J = 7.0, 1.4, 1H), 5.94 (d, J = 5.1, 1H), 3.80-3.75 (m, 4H), 3.47-3.41 (m, 4H), 3.38 (s, 3H). US10172859, Example 376 US11065253, Example 91 | US9732094, Example 91
Type:
Small organic molecule
Emp. Form.:
C25H23FN4O3
Mol. Mass.:
446.4735
SMILES:
Cn1c(cccc1=O)C(O)c1ccc(F)c(c1)-c1ncnc2cc(ccc12)N1CCOCC1
: