Target
DNA-dependent protein kinase catalytic subunit
Ligand
BDBM315715
Substrate
Meas. Tech.
Biochemical Assay
IC50
<3±n/a nM
Citation
 Fuchss, TEmde, UBuchstaller, HMederski, W Arylquinazolines US Patent  US11065253 Publication Date 7/20/2021 
Target
Name:
DNA-dependent protein kinase catalytic subunit
Synonyms:
DNA-PK catalytic subunit DNA-dependent protein kinase (DNA-PK) DNA-dependent protein kinase catalytic subunit (DNA-PK) HYRC PRKDC | PRKDC_HUMAN
Type:
Protein
Mol. Mass.:
469114.78
Organism:
Homo sapiens (Human)
Description:
P78527
Residue:
4128
  
Inhibitor
Name:
BDBM315715
Synonyms:
(S)-[2-Chloro-4- fluoro-5-(7- morpholin-4-yl- quinazolin-4-yl)- phenyl]-(6- methoxy- pyridazin-3-yl)- methanol1H NMR (500 MHz, DMSO-d6) ppm = 9.12 (s,1H), 7.91 (d, J = 7.7, 1H), 7.69 (d, J = 9.2, 1H),7.66 (d, J = 9.5, 1H), 7.61-7.52 (m, 2H), 7.24-7.19 (m, 2H), 6.61 (d, J = 5.0, 1H), 6.23 (d,J = 4.9, 1H), 4.00 (s, 3H), 3.81-3.75 (m, 4H),3.48-3.43 (m, 4H) US11065253, Example 136 | US9732094, Example 136
Type:
Small organic molecule
Emp. Form.:
C24H21ClFN5O3
Mol. Mass.:
481.907
SMILES:
COc1ccc(nn1)[C@@H](O)c1cc(c(F)cc1Cl)-c1ncnc2cc(ccc12)N1CCOCC1
: