Target
DNA-dependent protein kinase catalytic subunit
Ligand
BDBM315842
Substrate
Meas. Tech.
Biochemical Assay
IC50
<3±n/a nM
Citation
 Fuchss, TEmde, UBuchstaller, HMederski, W Arylquinazolines US Patent  US11065253 Publication Date 7/20/2021 
Target
Name:
DNA-dependent protein kinase catalytic subunit
Synonyms:
DNA-PK catalytic subunit DNA-dependent protein kinase (DNA-PK) DNA-dependent protein kinase catalytic subunit (DNA-PK) HYRC PRKDC | PRKDC_HUMAN
Type:
Protein
Mol. Mass.:
469114.78
Organism:
Homo sapiens (Human)
Description:
P78527
Residue:
4128
  
Inhibitor
Name:
BDBM315842
Synonyms:
US10172859, Example 263 US10172859, Example 278 US9732094, Example 278 | [2-Chloro-4-fluoro-5- (5-fluoro-7- morpholin-4-yl- quinazoin-4-yl)- phenyl]-(6-methoxy- pyridazin-3-yl)- methanol (Ena 2)see racemate
Type:
Small organic molecule
Emp. Form.:
C24H20ClF2N5O3
Mol. Mass.:
499.897
SMILES:
COc1ccc(nn1)C(O)c1cc(c(F)cc1Cl)-c1ncnc2cc(cc(F)c12)N1CCOCC1
: