Target
Plasma kallikrein
Ligand
BDBM433373
Substrate
Meas. Tech.
Activity Assay
Ki
<50.0±n/a nM
Citation
 Kotian, PLBabu, YSKumar, VSZhang, WVogeti, L Human plasma kallikrein inhibitors US Patent  US11066360 Publication Date 7/20/2021 
Target
Name:
Plasma kallikrein
Synonyms:
Fletcher factor KLKB1 Kallikrein Plasma kallikrein heavy chain Plasma prekallikrein
Type:
Protein
Mol. Mass.:
71391.16
Organism:
Homo sapiens (Human)
Description:
P03952
Residue:
638
  
Inhibitor
Name:
BDBM433373
Synonyms:
US10562850, Compound 18a | US11066360, Compound 18a
Type:
Small organic molecule
Emp. Form.:
C35H40ClFN6O4S
Mol. Mass.:
695.246
SMILES:
CO[C@@H]1C[C@@H](N(C1)C(=O)Nc1ccc(Cl)cn1)C(=O)Nc1cc(ccc1F)C(CCC1CC1)(N[S@](=O)C(C)(C)C)c1cccc(c1)C#N
: