Target
Plasma kallikrein
Ligand
BDBM433427
Substrate
Meas. Tech.
Activity Assay
Ki
>100.0±n/a nM
Citation
 Kotian, PLBabu, YSKumar, VSZhang, WVogeti, L Human plasma kallikrein inhibitors US Patent  US11066360 Publication Date 7/20/2021 
Target
Name:
Plasma kallikrein
Synonyms:
Fletcher factor KLKB1 Kallikrein Plasma kallikrein heavy chain Plasma prekallikrein
Type:
Protein
Mol. Mass.:
71391.16
Organism:
Homo sapiens (Human)
Description:
P03952
Residue:
638
  
Inhibitor
Name:
BDBM433427
Synonyms:
US10562850, Compound 9b | US11066360, Compound 9b
Type:
Small organic molecule
Emp. Form.:
C35H39ClFN5O4S
Mol. Mass.:
680.232
SMILES:
CC(C)(C)[S@@](=O)NC(CCC1CC1)(c1cccc(c1)C#N)c1ccc(F)c(NC(=O)[C@H]2C[C@H](O)CN2C(=O)Nc2ccc(Cl)cc2)c1
: