Target
Plasma kallikrein
Ligand
BDBM433443
Substrate
Meas. Tech.
Activity Assay
Ki
<50.0±n/a nM
Citation
 Kotian, PLBabu, YSKumar, VSZhang, WVogeti, L Human plasma kallikrein inhibitors US Patent  US11066360 Publication Date 7/20/2021 
Target
Name:
Plasma kallikrein
Synonyms:
Fletcher factor KLKB1 Kallikrein Plasma kallikrein heavy chain Plasma prekallikrein
Type:
Protein
Mol. Mass.:
71391.16
Organism:
Homo sapiens (Human)
Description:
P03952
Residue:
638
  
Inhibitor
Name:
BDBM433443
Synonyms:
US10562850, Compound 59d | US11066360, Compound 59d
Type:
Small organic molecule
Emp. Form.:
C31H34ClFN6O3
Mol. Mass.:
593.091
SMILES:
NC(CCC1CC1)(c1ccncc1)c1ccc(F)c(NC(=O)[C@H]2C[C@@](O)(CN2C(=O)Nc2ccc(Cl)cn2)C2CC2)c1
: