Target
Plasma kallikrein
Ligand
BDBM433454
Substrate
Meas. Tech.
Activity Assay
Ki
<50.0±n/a nM
Citation
 Kotian, PLBabu, YSKumar, VSZhang, WVogeti, L Human plasma kallikrein inhibitors US Patent  US11066360 Publication Date 7/20/2021 
Target
Name:
Plasma kallikrein
Synonyms:
Fletcher factor KLKB1 Kallikrein Plasma kallikrein heavy chain Plasma prekallikrein
Type:
Protein
Mol. Mass.:
71391.16
Organism:
Homo sapiens (Human)
Description:
P03952
Residue:
638
  
Inhibitor
Name:
BDBM433454
Synonyms:
US10562850, Compound 51b | US11066360, Compound 51b
Type:
Small organic molecule
Emp. Form.:
C30H34ClFN6O3
Mol. Mass.:
581.081
SMILES:
CCO[C@@H]1C[C@@H](N(C1)C(=O)Nc1ccc(Cl)cn1)C(=O)Nc1cc(ccc1F)C(N)(CCC1CC1)c1ccncc1
: