Target
Plasma kallikrein
Ligand
BDBM433459
Substrate
Meas. Tech.
Activity Assay
Ki
75.0±n/a nM
Citation
 Kotian, PLBabu, YSKumar, VSZhang, WVogeti, L Human plasma kallikrein inhibitors US Patent  US11066360 Publication Date 7/20/2021 
Target
Name:
Plasma kallikrein
Synonyms:
Fletcher factor KLKB1 Kallikrein Plasma kallikrein heavy chain Plasma prekallikrein
Type:
Protein
Mol. Mass.:
71391.16
Organism:
Homo sapiens (Human)
Description:
P03952
Residue:
638
  
Inhibitor
Name:
BDBM433459
Synonyms:
US10562850, Compound 80c | US11066360, Compound 80c
Type:
Small organic molecule
Emp. Form.:
C23H27FN4O
Mol. Mass.:
394.4851
SMILES:
NC(CCC1CC1)(c1ccncc1)c1ccc(F)c(NC(=O)[C@H]2C[C@H]3C[C@H]3N2)c1
: