Target
SRSF protein kinase 1
Ligand
BDBM504532
Substrate
Meas. Tech.
Inhibition Assay
IC50
41.0±n/a nM
Citation
 Hatcher, JGray, NSChoi, HJanne, PZhang, T Substituted 6,11-dihydro-5H-benzo[B]carbazoles as inhibitors of ALK and SRPK US Patent  US11066363 Publication Date 7/20/2021 
Target
Name:
SRSF protein kinase 1
Synonyms:
SRPK1 SRSF protein kinase 1 (SRPK1) Serine/threonine-protein kinase SRPK1
Type:
Protein
Mol. Mass.:
74318.38
Organism:
Homo sapiens (Human)
Description:
Q96SB4
Residue:
655
  
Inhibitor
Name:
BDBM504532
Synonyms:
4-(3-cyano-9-ethyl-6,6-dimethyl-11- oxo-6,11-dihydro-5H- benzo[b]carbazol-8- yl)benzenesulfonyl fluoride | US11066363, Compound 38
Type:
Small organic molecule
Emp. Form.:
C27H21FN2O3S
Mol. Mass.:
472.531
SMILES:
CCc1cc2C(=O)c3c([nH]c4cc(ccc34)C#N)C(C)(C)c2cc1-c1ccc(cc1)S(F)(=O)=O
: