Target
Ubiquitin carboxyl-terminal hydrolase 30
Ligand
BDBM404418
Substrate
Meas. Tech.
Biochemical Fluorescence Intensity Kinetic Assay
IC50
<100±n/a nM
Citation
 Jones, AKemp, MStockley, MGibson, KWhitlock, G 1-cyano-pyrrolidine compounds as USP30 inhibitors US Patent  US11066365 Publication Date 7/20/2021 
Target
Name:
Ubiquitin carboxyl-terminal hydrolase 30
Synonyms:
Deubiquitinating enzyme 30 USP30 Ubiquitin carboxyl-terminal hydrolase 30 (USP30) Ubiquitin-specific-processing protease 30
Type:
Protein
Mol. Mass.:
58522.90
Organism:
Homo sapiens (Human)
Description:
Q70CQ3
Residue:
517
  
Inhibitor
Name:
BDBM404418
Synonyms:
US10343992, Example 70 US11066365, Example 70 | US11390584, Example 70
Type:
Small organic molecule
Emp. Form.:
C16H16N4OS
Mol. Mass.:
312.389
SMILES:
C[C@@H]1CN(C[C@H]1NC(=O)c1ncc(s1)-c1ccccc1)C#N
: