Target
Ubiquitin carboxyl-terminal hydrolase 30
Ligand
BDBM404453
Substrate
Meas. Tech.
Biochemical Fluorescence Intensity Kinetic Assay
IC50
<100±n/a nM
Citation
 Jones, AKemp, MStockley, MGibson, KWhitlock, G 1-cyano-pyrrolidine compounds as USP30 inhibitors US Patent  US11066365 Publication Date 7/20/2021 
Target
Name:
Ubiquitin carboxyl-terminal hydrolase 30
Synonyms:
Deubiquitinating enzyme 30 USP30 Ubiquitin carboxyl-terminal hydrolase 30 (USP30) Ubiquitin-specific-processing protease 30
Type:
Protein
Mol. Mass.:
58522.90
Organism:
Homo sapiens (Human)
Description:
Q70CQ3
Residue:
517
  
Inhibitor
Name:
BDBM404453
Synonyms:
(R)-N-(1-cyanopyrrolidin- 3-yl)-2-fluoro-4-(2- methylpyrimidin-4- yl)benzamide US10689345, Example 105 US11390584, Example 105
Type:
Small organic molecule
Emp. Form.:
C17H16FN5O
Mol. Mass.:
325.3402
SMILES:
Cc1nccc(n1)-c1ccc(C(=O)N[C@@H]2CCN(C2)C#N)c(F)c1
: