Target
Ubiquitin carboxyl-terminal hydrolase 30
Ligand
BDBM404468
Substrate
Meas. Tech.
Biochemical Fluorescence Intensity Kinetic Assay
IC50
<100±n/a nM
Citation
 Jones, AKemp, MStockley, MGibson, KWhitlock, G 1-cyano-pyrrolidine compounds as USP30 inhibitors US Patent  US11066365 Publication Date 7/20/2021 
Target
Name:
Ubiquitin carboxyl-terminal hydrolase 30
Synonyms:
Deubiquitinating enzyme 30 USP30 Ubiquitin carboxyl-terminal hydrolase 30 (USP30) Ubiquitin-specific-processing protease 30
Type:
Protein
Mol. Mass.:
58522.90
Organism:
Homo sapiens (Human)
Description:
Q70CQ3
Residue:
517
  
Inhibitor
Name:
BDBM404468
Synonyms:
(R)-N-(1-cyanopyrrolidin- 3-yl)-3-fluoro-5-(1-methyl- 1H-indazol-5-yl)picolinamide US11066365, Example 120
Type:
Small organic molecule
Emp. Form.:
C19H17FN6O
Mol. Mass.:
364.3763
SMILES:
Cn1ncc2cc(ccc12)-c1cnc(C(=O)N[C@@H]2CCN(C2)C#N)c(F)c1
: