Target
Ubiquitin carboxyl-terminal hydrolase 30
Ligand
BDBM404515
Substrate
Meas. Tech.
Biochemical Fluorescence Intensity Kinetic Assay
IC50
<100±n/a nM
Citation
 Jones, AKemp, MStockley, MGibson, KWhitlock, G 1-cyano-pyrrolidine compounds as USP30 inhibitors US Patent  US11066365 Publication Date 7/20/2021 
Target
Name:
Ubiquitin carboxyl-terminal hydrolase 30
Synonyms:
Deubiquitinating enzyme 30 USP30 Ubiquitin carboxyl-terminal hydrolase 30 (USP30) Ubiquitin-specific-processing protease 30
Type:
Protein
Mol. Mass.:
58522.90
Organism:
Homo sapiens (Human)
Description:
Q70CQ3
Residue:
517
  
Inhibitor
Name:
BDBM404515
Synonyms:
(R)-6-(3-cyanophenyl)-N-(1-cyanopyrrolidin-3-yl)-3-fluoroimidazo[1,2-a]pyridine-2-carboxamide US10689345, Example 167 US11066365, Example 167 | US11390584, Example 167
Type:
Small organic molecule
Emp. Form.:
C20H15FN6O
Mol. Mass.:
374.3711
SMILES:
Fc1c(nc2ccc(cn12)-c1cccc(c1)C#N)C(=O)N[C@@H]1CCN(C1)C#N
: