Target
Ubiquitin carboxyl-terminal hydrolase 30
Ligand
BDBM447634
Substrate
Meas. Tech.
Biochemical Fluorescence Intensity Kinetic Assay
IC50
<100±n/a nM
Citation
 Jones, AKemp, MStockley, MGibson, KWhitlock, G 1-cyano-pyrrolidine compounds as USP30 inhibitors US Patent  US11066365 Publication Date 7/20/2021 
Target
Name:
Ubiquitin carboxyl-terminal hydrolase 30
Synonyms:
Deubiquitinating enzyme 30 USP30 Ubiquitin carboxyl-terminal hydrolase 30 (USP30) Ubiquitin-specific-processing protease 30
Type:
Protein
Mol. Mass.:
58522.90
Organism:
Homo sapiens (Human)
Description:
Q70CQ3
Residue:
517
  
Inhibitor
Name:
BDBM447634
Synonyms:
(R)—N-(1-cyanopyrrolidin-3-yl)-5-(4-fluorophenyl)picolinamide US11053198, Example 173 | US11066365, Example 173
Type:
Small organic molecule
Emp. Form.:
C15H20BrN3O3
Mol. Mass.:
370.242
SMILES:
CC(C)(C)OC(=O)N1CC[C@H](C1)NC(=O)c1ccc(Br)cn1
: