Target
Histone deacetylase 6
Ligand
BDBM504550
Substrate
Meas. Tech.
Enzymatic Assay
IC50
4.70±n/a nM
Citation
 Walji, ABerger, RStump, CASchlegel, KSMulhearn, JJGreshock, TJWang, DFraley, MEJones, KG 3-aryl- heteroaryl substituted 5-trifluoromethyl oxadiazoles as histonedeacetylase 6 (HDAC6) inhibitors US Patent  US11066396 Publication Date 7/20/2021 
Target
Name:
Histone deacetylase 6
Synonyms:
Cereblon/Histone deacetylase 6 HDAC6 Histone deacetylase 6 (HDAC6) KIAA0901 | ORF Names:JM21
Type:
Chromatin regulator; hydrolase; repressor
Mol. Mass.:
131381.51
Organism:
Homo sapiens (Human)
Description:
Q9UBN7
Residue:
1215
  
Inhibitor
Name:
BDBM504550
Synonyms:
(S)-5-(Benzo[d]oxazol-2-yl)-1-(2-fluoro-4-(5-(trifluoromethyl)-1,2,4-oxadiazol-3-yl)phenyl)pyrrolidin-2-one | US11066396, Example 22
Type:
Small organic molecule
Emp. Form.:
C20H12F4N4O3
Mol. Mass.:
432.3279
SMILES:
Fc1cc(ccc1N1[C@@H](CCC1=O)c1nc2ccccc2o1)-c1noc(n1)C(F)(F)F
: