Target
Histone deacetylase 6
Ligand
BDBM504624
Substrate
Meas. Tech.
Enzymatic Assay
IC50
8.10±n/a nM
Citation
 Walji, ABerger, RStump, CASchlegel, KSMulhearn, JJGreshock, TJWang, DFraley, MEJones, KG 3-aryl- heteroaryl substituted 5-trifluoromethyl oxadiazoles as histonedeacetylase 6 (HDAC6) inhibitors US Patent  US11066396 Publication Date 7/20/2021 
Target
Name:
Histone deacetylase 6
Synonyms:
Cereblon/Histone deacetylase 6 HDAC6 Histone deacetylase 6 (HDAC6) KIAA0901 | ORF Names:JM21
Type:
Chromatin regulator; hydrolase; repressor
Mol. Mass.:
131381.51
Organism:
Homo sapiens (Human)
Description:
Q9UBN7
Residue:
1215
  
Inhibitor
Name:
BDBM504624
Synonyms:
N-(3- fluorophenyl)-N- ((5-(5- (trifluoromethyl)- 1,2,4-oxadiazol-3- yl)pyridin-2- yl)methyl)tetrahydro- 2H-thiopyran- 4-carboxamide 1,1-dioxide | US11066396, Example 55
Type:
Small organic molecule
Emp. Form.:
C21H18F4N4O4S
Mol. Mass.:
498.451
SMILES:
Fc1cccc(c1)N(Cc1ccc(cn1)-c1noc(n1)C(F)(F)F)C(=O)C1CCS(=O)(=O)CC1
: