Target
Histone deacetylase 6
Ligand
BDBM504687
Substrate
Meas. Tech.
Enzymatic Assay
IC50
7.60±n/a nM
Citation
 Walji, ABerger, RStump, CASchlegel, KSMulhearn, JJGreshock, TJWang, DFraley, MEJones, KG 3-aryl- heteroaryl substituted 5-trifluoromethyl oxadiazoles as histonedeacetylase 6 (HDAC6) inhibitors US Patent  US11066396 Publication Date 7/20/2021 
Target
Name:
Histone deacetylase 6
Synonyms:
Cereblon/Histone deacetylase 6 HDAC6 Histone deacetylase 6 (HDAC6) KIAA0901 | ORF Names:JM21
Type:
Chromatin regulator; hydrolase; repressor
Mol. Mass.:
131381.51
Organism:
Homo sapiens (Human)
Description:
Q9UBN7
Residue:
1215
  
Inhibitor
Name:
BDBM504687
Synonyms:
(S)-5-(3-(pyridin-4- yl)-1,2,4-oxadiazol- 5-yl)-1-(4-(5- (trifluoromethyl)- 1,2,4-oxadiazol-3- yl)phenyl) pyrrolidin-2-one | US11066396, Example 114
Type:
Small organic molecule
Emp. Form.:
C20H13F3N6O3
Mol. Mass.:
442.3508
SMILES:
FC(F)(F)c1nc(no1)-c1ccc(cc1)N1[C@@H](CCC1=O)c1nc(no1)-c1ccncc1
: