Target
Histone deacetylase 6
Ligand
BDBM504691
Substrate
Meas. Tech.
Enzymatic Assay
IC50
5.10±n/a nM
Citation
 Walji, ABerger, RStump, CASchlegel, KSMulhearn, JJGreshock, TJWang, DFraley, MEJones, KG 3-aryl- heteroaryl substituted 5-trifluoromethyl oxadiazoles as histonedeacetylase 6 (HDAC6) inhibitors US Patent  US11066396 Publication Date 7/20/2021 
Target
Name:
Histone deacetylase 6
Synonyms:
Cereblon/Histone deacetylase 6 HDAC6 Histone deacetylase 6 (HDAC6) KIAA0901 | ORF Names:JM21
Type:
Chromatin regulator; hydrolase; repressor
Mol. Mass.:
131381.51
Organism:
Homo sapiens (Human)
Description:
Q9UBN7
Residue:
1215
  
Inhibitor
Name:
BDBM504691
Synonyms:
1-(2-fluoro-4-(5- (trifluoromethyl)- 1,2,4-oxadiazol-3- yl)phenyl)-5-(2- fluorophenyl) pyrrolidin-2-one US11066396, Example 313
Type:
Small organic molecule
Emp. Form.:
C19H12F5N3O2
Mol. Mass.:
409.3095
SMILES:
Fc1ccccc1C1CCC(=O)N1c1ccc(cc1F)-c1noc(n1)C(F)(F)F
: