Target
Histone deacetylase 6
Ligand
BDBM504913
Substrate
Meas. Tech.
Enzymatic Assay
IC50
3.90±n/a nM
Citation
 Walji, ABerger, RStump, CASchlegel, KSMulhearn, JJGreshock, TJWang, DFraley, MEJones, KG 3-aryl- heteroaryl substituted 5-trifluoromethyl oxadiazoles as histonedeacetylase 6 (HDAC6) inhibitors US Patent  US11066396 Publication Date 7/20/2021 
Target
Name:
Histone deacetylase 6
Synonyms:
Cereblon/Histone deacetylase 6 HDAC6 Histone deacetylase 6 (HDAC6) KIAA0901 | ORF Names:JM21
Type:
Chromatin regulator; hydrolase; repressor
Mol. Mass.:
131381.51
Organism:
Homo sapiens (Human)
Description:
Q9UBN7
Residue:
1215
  
Inhibitor
Name:
BDBM504913
Synonyms:
6-fluoro- 1-({5-[5- (trifluoro- methyl)- 1,2,4-oxa- diazol-3- yl]pyridin- 2-yl} methyl)- 3,4-dihydro- quinolin- 2(1H)-one | US11066396, Example 317
Type:
Small organic molecule
Emp. Form.:
C18H12F4N4O2
Mol. Mass.:
392.3071
SMILES:
Fc1ccc2N(Cc3ccc(cn3)-c3noc(n3)C(F)(F)F)C(=O)CCc2c1
: