Target
Histone deacetylase 6
Ligand
BDBM505052
Substrate
Meas. Tech.
Enzymatic Assay
IC50
4.20±n/a nM
Citation
 Walji, ABerger, RStump, CASchlegel, KSMulhearn, JJGreshock, TJWang, DFraley, MEJones, KG 3-aryl- heteroaryl substituted 5-trifluoromethyl oxadiazoles as histonedeacetylase 6 (HDAC6) inhibitors US Patent  US11066396 Publication Date 7/20/2021 
Target
Name:
Histone deacetylase 6
Synonyms:
Cereblon/Histone deacetylase 6 HDAC6 Histone deacetylase 6 (HDAC6) KIAA0901 | ORF Names:JM21
Type:
Chromatin regulator; hydrolase; repressor
Mol. Mass.:
131381.51
Organism:
Homo sapiens (Human)
Description:
Q9UBN7
Residue:
1215
  
Inhibitor
Name:
BDBM505052
Synonyms:
3-[({5-[5- (trifluoro- methyl)- 1,2,4-oxa- diazol-3- yl]pyridin- 2-yl} methyl) amino] benzamide | US11066396, Example 449
Type:
Small organic molecule
Emp. Form.:
C16H12F3N5O2
Mol. Mass.:
363.294
SMILES:
NC(=O)c1cccc(NCc2ccc(cn2)-c2noc(n2)C(F)(F)F)c1
: