Target
Cyclin-dependent kinase 2/G1/S-specific cyclin-E1
Ligand
BDBM505102
Substrate
Meas. Tech.
HTRF Enzyme Activity Assay
IC50
200±n/a nM
Citation
 Sokolsky, AWu, LYao, W Dihydropyrido[2,3-d]pyrimidinone compounds as CDK2 inhibitors US Patent  US11066404 Publication Date 7/20/2021 
Target
Name:
Cyclin-dependent kinase 2/G1/S-specific cyclin-E1
Synonyms:
CDK2/CycE CDK2/E Cyclin-Dependent Kinase 2 (CDK2) Cyclin-dependent kinase 2/cyclin E1
Type:
Protein
Mol. Mass.:
Description:
Components:
This complex has 2 components.
Component 1
Name:
Cyclin-dependent kinase 2
Synonyms:
CDK2 CDK2_HUMAN Cell division protein kinase 2 Protein cereblon/Cyclin-dependent kinase 2 | p33 protein kinase
Type:
Enzyme Subunit
Mol. Mass.:
33938.17
Organism:
Homo sapiens (Human)
Description:
P24941
Residue:
298
  
Component 2
Name:
G1/S-specific cyclin-E1
Synonyms:
CCNE CCNE1_HUMAN
Type:
Enzyme Subunit
Mol. Mass.:
47073.17
Organism:
Homo sapiens (Human)
Description:
Residue:
410
  
Inhibitor
Name:
BDBM505102
Synonyms:
US11066404, Example 5
Type:
Small organic molecule
Emp. Form.:
C20H29N7O3S
Mol. Mass.:
447.554
SMILES:
Cn1nccc1CN1C(=O)C(C)(C)Cc2cnc(NC3CCN(CC3)S(C)(=O)=O)nc12
: