Target
Tyrosine-protein kinase JAK2 [532-1132]
Ligand
BDBM505105
Substrate
Meas. Tech.
Enzymatic Inhibition Assay
IC50
<0.200±n/a nM
Citation
 Fernandes, PKrawczuk, PJTichenor, MS Small molecule inhibitors of the JAK family of kinases US Patent  US11066406 Publication Date 7/20/2021 
Target
Name:
Tyrosine-protein kinase JAK2 [532-1132]
Synonyms:
JAK2 JAK2_HUMAN
Type:
Protein
Mol. Mass.:
69777.30
Organism:
Homo sapiens (Human)
Description:
O60674[532-1132]
Residue:
601
  
Inhibitor
Name:
BDBM505105
Synonyms:
US11066406, B
Type:
Small organic molecule
Emp. Form.:
C17H18N4O
Mol. Mass.:
294.351
SMILES:
OCc1nc2ccc3[nH]ccc3c2n1C1CCC(CC1)C#N
: