Target
Tyrosine-protein kinase JAK1 [574-1154]
Ligand
BDBM505111
Substrate
Meas. Tech.
Enzymatic Inhibition Assay
IC50
0.300±n/a nM
Citation
 Fernandes, PKrawczuk, PJTichenor, MS Small molecule inhibitors of the JAK family of kinases US Patent  US11066406 Publication Date 7/20/2021 
Target
Name:
Tyrosine-protein kinase JAK1 [574-1154]
Synonyms:
JAK1 JAK1A JAK1_HUMAN
Type:
Protein
Mol. Mass.:
66641.39
Organism:
Homo sapiens (Human)
Description:
P23458[574-1154]
Residue:
581
  
Inhibitor
Name:
BDBM505111
Synonyms:
US11066406, Ex. 5
Type:
Small organic molecule
Emp. Form.:
C23H28N6O2
Mol. Mass.:
420.5074
SMILES:
O=C(Cc1nc2cnc3[nH]ccc3c2n1C1CCC(CC#N)CC1)NC1CCOCC1
: