Target
Tyrosine-protein kinase JAK2 [532-1132]
Ligand
BDBM505113
Substrate
Meas. Tech.
Enzymatic Inhibition Assay
IC50
5.60±n/a nM
Citation
 Fernandes, PKrawczuk, PJTichenor, MS Small molecule inhibitors of the JAK family of kinases US Patent  US11066406 Publication Date 7/20/2021 
Target
Name:
Tyrosine-protein kinase JAK2 [532-1132]
Synonyms:
JAK2 JAK2_HUMAN
Type:
Protein
Mol. Mass.:
69777.30
Organism:
Homo sapiens (Human)
Description:
O60674[532-1132]
Residue:
601
  
Inhibitor
Name:
BDBM505113
Synonyms:
US11066406, Ex. 7
Type:
Small organic molecule
Emp. Form.:
C23H27N7O
Mol. Mass.:
417.5068
SMILES:
CC(C)(CNC(=O)Cc1nc2cnc3[nH]ccc3c2n1C1CCC(CC#N)CC1)C#N
: