Target
Tyrosine-protein kinase JAK2 [532-1132]
Ligand
BDBM505115
Substrate
Meas. Tech.
Enzymatic Inhibition Assay
IC50
6.60±n/a nM
Citation
 Fernandes, PKrawczuk, PJTichenor, MS Small molecule inhibitors of the JAK family of kinases US Patent  US11066406 Publication Date 7/20/2021 
Target
Name:
Tyrosine-protein kinase JAK2 [532-1132]
Synonyms:
JAK2 JAK2_HUMAN
Type:
Protein
Mol. Mass.:
69777.30
Organism:
Homo sapiens (Human)
Description:
O60674[532-1132]
Residue:
601
  
Inhibitor
Name:
BDBM505115
Synonyms:
US11066406, Ex. 9
Type:
Small organic molecule
Emp. Form.:
C22H24N8O
Mol. Mass.:
416.479
SMILES:
Cn1cc(NC(=O)Cc2nc3cnc4[nH]ccc4c3n2C2CCC(CC#N)CC2)cn1
: