Target
Non-receptor tyrosine-protein kinase TYK2 [580-1182]
Ligand
BDBM505115
Substrate
Meas. Tech.
Enzymatic Inhibition Assay
IC50
4.70±n/a nM
Citation
 Fernandes, PKrawczuk, PJTichenor, MS Small molecule inhibitors of the JAK family of kinases US Patent  US11066406 Publication Date 7/20/2021 
Target
Name:
Non-receptor tyrosine-protein kinase TYK2 [580-1182]
Synonyms:
TYK2 TYK2_HUMAN
Type:
Mol. Mass.:
68754.63
Organism:
Homo sapiens (Human)
Description:
P29597[580-1182]
Residue:
608
  
Inhibitor
Name:
BDBM505115
Synonyms:
US11066406, Ex. 9
Type:
Small organic molecule
Emp. Form.:
C22H24N8O
Mol. Mass.:
416.479
SMILES:
Cn1cc(NC(=O)Cc2nc3cnc4[nH]ccc4c3n2C2CCC(CC#N)CC2)cn1
: