Target
Tyrosine-protein kinase JAK3 [512-1124]
Ligand
BDBM505117
Substrate
Meas. Tech.
Enzymatic Inhibition Assay
IC50
30.3±n/a nM
Citation
 Fernandes, PKrawczuk, PJTichenor, MS Small molecule inhibitors of the JAK family of kinases US Patent  US11066406 Publication Date 7/20/2021 
Target
Name:
Tyrosine-protein kinase JAK3 [512-1124]
Synonyms:
JAK3 JAK3_HUMAN
Type:
Protein
Mol. Mass.:
68951.94
Organism:
Homo sapiens (Human)
Description:
P52333[512-1124]
Residue:
613
  
Inhibitor
Name:
BDBM505117
Synonyms:
US11066406, Ex. 11
Type:
Small organic molecule
Emp. Form.:
C21H22N8O
Mol. Mass.:
402.4524
SMILES:
O=C(Cc1nc2cnc3[nH]ccc3c2n1C1CCC(CC#N)CC1)Nc1cc[nH]n1
: