Target
Tyrosine-protein kinase JAK2 [532-1132]
Ligand
BDBM505118
Substrate
Meas. Tech.
Enzymatic Inhibition Assay
IC50
9.40±n/a nM
Citation
 Fernandes, PKrawczuk, PJTichenor, MS Small molecule inhibitors of the JAK family of kinases US Patent  US11066406 Publication Date 7/20/2021 
Target
Name:
Tyrosine-protein kinase JAK2 [532-1132]
Synonyms:
JAK2 JAK2_HUMAN
Type:
Protein
Mol. Mass.:
69777.30
Organism:
Homo sapiens (Human)
Description:
O60674[532-1132]
Residue:
601
  
Inhibitor
Name:
BDBM505118
Synonyms:
US11066406, Ex. 12
Type:
Small organic molecule
Emp. Form.:
C22H26N6O2
Mol. Mass.:
406.4808
SMILES:
OC1(CNC(=O)Cc2nc3cnc4[nH]ccc4c3n2C2CCC(CC#N)CC2)CC1
: