Target
Plasmepsin II
Ligand
BDBM7977
Substrate
Peptide Substrate
Meas. Tech.
Enzyme Inhibition Measurements
pH
4.5±n/a
Temperature
295.15±n/a K
Ki
2.2±n/a nM
Citation
 Johansson, POChen, YBelfrage, AKBlackman, MJKvarnstrom, IJansson, KVrang, LHamelink, EHallberg, ARosenquist, ASamuelsson, B Design and synthesis of potent inhibitors of the malaria aspartyl proteases plasmepsin I and II. Use of solid-phase synthesis to explore novel statine motifs. J Med Chem 47:3353-66 (2004)  
Target
Name:
Plasmepsin II
Synonyms:
Aspartic hemoglobinase II PLM2_PLAFX Plasmepsin 2 Plasmepsin-II
Type:
Enzyme
Mol. Mass.:
51482.09
Organism:
Plasmodium falciparum
Description:
P46925
Residue:
453
  
Inhibitor
Name:
BDBM7977
Synonyms:
(3S,4S)-5-[(4-bromophenyl)methoxy]-N-[(1S)-1-{[(1S)-1-carbamoyl-3-methylbutyl]carbamoyl}ethyl]-3-hydroxy-4-[(2S)-3-methyl-2-(pyridin-2-ylformamido)butanamido]pentanamide Pyridine-2-carboxylic Acid ((S)-1-{(1S,2S)-1-(4-Bromobenzyloxymethyl)3-[(S)-1-((S)-1-carbamoyl-3-methyl-butylcarbamoyl)ethylcarbamoyl]-2-hydroxypropylcarbamoyl}-2-methylpropyl)amide | Statine-like inhibitor 16
Type:
Small organic molecule
Emp. Form.:
C32H45BrN6O7
Mol. Mass.:
705.64
SMILES:
CC(C)C[C@H](NC(=O)[C@H](C)NC(=O)C[C@H](O)[C@H](COCc1ccc(Br)cc1)NC(=O)[C@@H](NC(=O)c1ccccn1)C(C)C)C(N)=O
:
Substrate
Name:
Peptide Substrate
Synonyms:
Type:
Peptide
Mol. Mass.:
3501.67
Organism:
Description:
Residue:
31