Target
P2X purinoceptor 7
Ligand
BDBM505205
Substrate
Meas. Tech.
Inhibition Assay
IC50
<10±n/a nM
Citation
 Masuda, KSugiyama, SYamada, TKojima, EOgawa, TKobayashi, NKai, H Bicyclic nitrogen-containing heterocyclic derivatives and pharmaceutical composition comprising the same US Patent  US11066409 Publication Date 7/20/2021 
Target
Name:
P2X purinoceptor 7
Synonyms:
ATP receptor P2RX7_HUMAN P2X purinoceptor 7 (P2X7) P2Z receptor | Purinergic receptor
Type:
Protein
Mol. Mass.:
68602.85
Organism:
Homo sapiens (Human)
Description:
Q99572
Residue:
595
  
Inhibitor
Name:
BDBM505205
Synonyms:
US11066409, Compound I-0065
Type:
Small organic molecule
Emp. Form.:
C22H21F2N3O2
Mol. Mass.:
397.4178
SMILES:
Cc1cc(\N=c2/[nH]c(=O)cc3CCC(c4ccccc4)n23)c(C)cc1OC(F)F
: