Target
P2X purinoceptor 7
Ligand
BDBM505219
Substrate
Meas. Tech.
Inhibition Assay
IC50
<10±n/a nM
Citation
 Masuda, KSugiyama, SYamada, TKojima, EOgawa, TKobayashi, NKai, H Bicyclic nitrogen-containing heterocyclic derivatives and pharmaceutical composition comprising the same US Patent  US11066409 Publication Date 7/20/2021 
Target
Name:
P2X purinoceptor 7
Synonyms:
ATP receptor P2RX7_HUMAN P2X purinoceptor 7 (P2X7) P2Z receptor | Purinergic receptor
Type:
Protein
Mol. Mass.:
68602.85
Organism:
Homo sapiens (Human)
Description:
Q99572
Residue:
595
  
Inhibitor
Name:
BDBM505219
Synonyms:
US11066409, Compound I-0080
Type:
Small organic molecule
Emp. Form.:
C21H20F2N4O2
Mol. Mass.:
398.4059
SMILES:
CCOc1ccc(\N=c2/[nH]c(=O)c(F)c3CCC(c4ccc(F)cc4)n23)c(C)n1
: