Target
Adenosine receptor A2a
Ligand
BDBM505344
Substrate
Meas. Tech.
Binding Affinity Assay
IC50
152±n/a nM
Citation
 Wang, YZhang, NWu, T Aminopyrimidine five-membered heterocyclic compound, and intermediate, preparation method, pharmaceutical composition and application thereof US Patent  US11066413 Publication Date 7/20/2021 
Target
Name:
Adenosine receptor A2a
Synonyms:
A2A adenosine receptor (hA2A) ADENOSINE A2 ADORA2 Adenosine A2A receptor (A2AAR)
Type:
G Protein-Coupled Receptor (GPCR)
Mol. Mass.:
44716.46
Organism:
Homo sapiens (Human)
Description:
P29274
Residue:
412
  
Inhibitor
Name:
BDBM505344
Synonyms:
US11066413, Compound 13
Type:
Small organic molecule
Emp. Form.:
C18H15N3O5S
Mol. Mass.:
385.394
SMILES:
CS(=O)(=O)c1ccc(CC2OC(=O)c3c2nc(N)nc3-c2ccco2)cc1
: