Target
Adenosine receptor A2a
Ligand
BDBM505348
Substrate
Meas. Tech.
Binding Affinity Assay
IC50
29.2±n/a nM
Citation
 Wang, YZhang, NWu, T Aminopyrimidine five-membered heterocyclic compound, and intermediate, preparation method, pharmaceutical composition and application thereof US Patent  US11066413 Publication Date 7/20/2021 
Target
Name:
Adenosine receptor A2a
Synonyms:
A2A adenosine receptor (hA2A) ADENOSINE A2 ADORA2 Adenosine A2A receptor (A2AAR)
Type:
G Protein-Coupled Receptor (GPCR)
Mol. Mass.:
44716.46
Organism:
Homo sapiens (Human)
Description:
P29274
Residue:
412
  
Inhibitor
Name:
BDBM505348
Synonyms:
US11066413, Compound 17
Type:
Small organic molecule
Emp. Form.:
C17H11ClFN3O3
Mol. Mass.:
359.739
SMILES:
Nc1nc2C(Cc3c(F)cccc3Cl)OC(=O)c2c(n1)-c1ccco1
: