Target
Adenosine receptor A2a
Ligand
BDBM505370
Substrate
Meas. Tech.
Binding Affinity Assay
IC50
128±n/a nM
Citation
 Wang, YZhang, NWu, T Aminopyrimidine five-membered heterocyclic compound, and intermediate, preparation method, pharmaceutical composition and application thereof US Patent  US11066413 Publication Date 7/20/2021 
Target
Name:
Adenosine receptor A2a
Synonyms:
A2A adenosine receptor (hA2A) ADENOSINE A2 ADORA2 Adenosine A2A receptor (A2AAR)
Type:
G Protein-Coupled Receptor (GPCR)
Mol. Mass.:
44716.46
Organism:
Homo sapiens (Human)
Description:
P29274
Residue:
412
  
Inhibitor
Name:
BDBM505370
Synonyms:
US11066413, Compound 39
Type:
Small organic molecule
Emp. Form.:
C19H15F2N3O4
Mol. Mass.:
387.3369
SMILES:
Cc1ccc(o1)-c1nc(N)nc2C(Cc3ccccc3OC(F)F)OC(=O)c12
: