Target
Adenosine receptor A2a
Ligand
BDBM505372
Substrate
Meas. Tech.
Binding Affinity Assay
IC50
43.5±n/a nM
Citation
 Wang, YZhang, NWu, T Aminopyrimidine five-membered heterocyclic compound, and intermediate, preparation method, pharmaceutical composition and application thereof US Patent  US11066413 Publication Date 7/20/2021 
Target
Name:
Adenosine receptor A2a
Synonyms:
A2A adenosine receptor (hA2A) ADENOSINE A2 ADORA2 Adenosine A2A receptor (A2AAR)
Type:
G Protein-Coupled Receptor (GPCR)
Mol. Mass.:
44716.46
Organism:
Homo sapiens (Human)
Description:
P29274
Residue:
412
  
Inhibitor
Name:
BDBM505372
Synonyms:
US11066413, Compound 41
Type:
Small organic molecule
Emp. Form.:
C17H14FN5O2
Mol. Mass.:
339.3238
SMILES:
Cn1c2c(nc(N)nc2n(Cc2ccccc2F)c1=O)-c1ccco1
: