Target
Adenosine receptor A2a
Ligand
BDBM505380
Substrate
Meas. Tech.
Binding Affinity Assay
IC50
32.1±n/a nM
Citation
 Wang, YZhang, NWu, T Aminopyrimidine five-membered heterocyclic compound, and intermediate, preparation method, pharmaceutical composition and application thereof US Patent  US11066413 Publication Date 7/20/2021 
Target
Name:
Adenosine receptor A2a
Synonyms:
A2A adenosine receptor (hA2A) ADENOSINE A2 ADORA2 Adenosine A2A receptor (A2AAR)
Type:
G Protein-Coupled Receptor (GPCR)
Mol. Mass.:
44716.46
Organism:
Homo sapiens (Human)
Description:
P29274
Residue:
412
  
Inhibitor
Name:
BDBM505380
Synonyms:
US11066413, Compound 49
Type:
Small organic molecule
Emp. Form.:
C19H16F2N4O2
Mol. Mass.:
370.3527
SMILES:
CN1C(Cc2ccc(F)cc2F)c2nc(N)nc(-c3ccc(C)o3)c2C1=O
: