Target
Adenosine receptor A2a
Ligand
BDBM505390
Substrate
Meas. Tech.
Binding Affinity Assay
IC50
179±n/a nM
Citation
 Wang, YZhang, NWu, T Aminopyrimidine five-membered heterocyclic compound, and intermediate, preparation method, pharmaceutical composition and application thereof US Patent  US11066413 Publication Date 7/20/2021 
Target
Name:
Adenosine receptor A2a
Synonyms:
A2A adenosine receptor (hA2A) ADENOSINE A2 ADORA2 Adenosine A2A receptor (A2AAR)
Type:
G Protein-Coupled Receptor (GPCR)
Mol. Mass.:
44716.46
Organism:
Homo sapiens (Human)
Description:
P29274
Residue:
412
  
Inhibitor
Name:
BDBM505390
Synonyms:
US11066413, Compound 59
Type:
Small organic molecule
Emp. Form.:
C18H17N5O2
Mol. Mass.:
335.3599
SMILES:
CN1C(Cc2ccncc2)c2nc(N)nc(-c3ccc(C)o3)c2C1=O
: