Target
Adenosine receptor A2a
Ligand
BDBM505392
Substrate
Meas. Tech.
Binding Affinity Assay
IC50
213±n/a nM
Citation
 Wang, YZhang, NWu, T Aminopyrimidine five-membered heterocyclic compound, and intermediate, preparation method, pharmaceutical composition and application thereof US Patent  US11066413 Publication Date 7/20/2021 
Target
Name:
Adenosine receptor A2a
Synonyms:
A2A adenosine receptor (hA2A) ADENOSINE A2 ADORA2 Adenosine A2A receptor (A2AAR)
Type:
G Protein-Coupled Receptor (GPCR)
Mol. Mass.:
44716.46
Organism:
Homo sapiens (Human)
Description:
P29274
Residue:
412
  
Inhibitor
Name:
BDBM505392
Synonyms:
US11066413, Compound 61
Type:
Small organic molecule
Emp. Form.:
C19H16F3N5O2
Mol. Mass.:
403.3578
SMILES:
Cc1ccc(o1)-c1nc(N)nc2n(Cc3ccc(C)cc3C(F)(F)F)c(=O)[nH]c12
: