Target
Epidermal growth factor receptor
Ligand
BDBM505417
Substrate
Meas. Tech.
High Throughput Biochemical Assay
IC50
1.000±n/a nM
Citation
 Bacon, EMBalan, GChou, CClark, CTCottell, JJKim, MKirschberg, TALink, JOPhillips, GSchroeder, SDSquires, NHStevens, KLTaylor, JGWatkins, WJWright, NEZipfel, SM Cot modulators and methods of use thereof US Patent  US11066414 Publication Date 7/20/2021 
Target
Name:
Epidermal growth factor receptor
Synonyms:
EGF Receptor Substrate EGFR_HUMAN ERBB1 Epidermal Growth Factor Receptor erbB-1 Epidermal growth factor receptor (EGFR) HER1 Proto-oncogene c-ErbB-1 Tyrosine-Protein Kinase ErbB-1
Type:
Receptor Kinase Domain
Mol. Mass.:
134279.59
Organism:
Homo sapiens (Human)
Description:
P00533
Residue:
1210
  
Inhibitor
Name:
BDBM505417
Synonyms:
(S)-8-chloro-6-(((1-cyclopropyl-1H- 1,2,3-triazol-4-yl)(6-(oxetan-3-yl)- 4,5,6,7-tetrahydrothieno[2,3-c]pyridin- 3-yl)methyl)amino)-4 -(neopentylamino)- quinoline-3-carbonitrile US11066414, Compound 81 | US11066414, Compound 91
Type:
Small organic molecule
Emp. Form.:
C31H37ClN8OS
Mol. Mass.:
605.196
SMILES:
CC(C)(C)CNc1c(cnc2c(Cl)cc(NC(C3=CN(NN3)C3CC3)c3csc4CN(CCc34)C3COC3)cc12)C#N
: