Target
Epidermal growth factor receptor
Ligand
BDBM505700
Substrate
Meas. Tech.
High Throughput Biochemical Assay
IC50
1.000±n/a nM
Citation
 Bacon, EMBalan, GChou, CClark, CTCottell, JJKim, MKirschberg, TALink, JOPhillips, GSchroeder, SDSquires, NHStevens, KLTaylor, JGWatkins, WJWright, NEZipfel, SM Cot modulators and methods of use thereof US Patent  US11066414 Publication Date 7/20/2021 
Target
Name:
Epidermal growth factor receptor
Synonyms:
EGF Receptor Substrate EGFR_HUMAN ERBB1 Epidermal Growth Factor Receptor erbB-1 Epidermal growth factor receptor (EGFR) HER1 Proto-oncogene c-ErbB-1 Tyrosine-Protein Kinase ErbB-1
Type:
Receptor Kinase Domain
Mol. Mass.:
134279.59
Organism:
Homo sapiens (Human)
Description:
P00533
Residue:
1210
  
Inhibitor
Name:
BDBM505700
Synonyms:
(S)-8-chloro-4-((3-chloro-4- fluorophenyl)amino)-6-(((1-(1- ethylpiperidin-4-yl)-1H-1,2,3-triazol- 4-yl)(pyridin-3-yl)methyl)amino)- quinoline-3-carbonitrile | US11066414, Compound 362
Type:
Small organic molecule
Emp. Form.:
C31H30Cl2FN9
Mol. Mass.:
618.535
SMILES:
CCN1CCC(CC1)N1NNC(=C1)[C@@H](Nc1cc(Cl)c2ncc(C#N)c(Nc3ccc(F)c(Cl)c3)c2c1)c1cccnc1
: